BDBM29422 7-alkoxyisoquinoline, 32
SMILES NS(=O)(=O)c1ccc(cc1)-c1cc2ccncc2cc1OC1CCCNC1
InChI Key InChIKey=FPCOVWJHQJRSNW-UHFFFAOYSA-N
Data  2 IC50
  Tab Delimited (TSV)   2D SDfile   Computed 3D by Vconf -m prep SDfile
Find this compound or compounds like it in BindingDB:
Activity Spreadsheet -- Enzyme Inhibition Constant Data from BindingDB
Found 2 hits for monomerid = 29422
LigandPNGBDBM29422(7-alkoxyisoquinoline, 32)
Affinity DataIC50:  794nM. Assay description: IKK kinase activity was assessed using a time-resolved fluorescence resonance energy transfer (TR-FRET) assay. The reaction was initiated by the addi...
In DepthDetails ArticlePubMed
LigandPNGBDBM29422(7-alkoxyisoquinoline, 32)
Affinity DataIC50:  1.26E+4nMpH: 7.4 T: 2°C. Assay description: IKK kinase activity was assessed using a time-resolved fluorescence resonance energy transfer (TR-FRET) assay. The reaction was initiated by the addi...
In DepthDetails ArticlePubMed