BDBM294263 Cis-N-(1-(4-benzyl-7-fluoro-3-(methylamino)chroman-6-yl)azetidin-3-yl)-1-methyl-1H-pyrazole-4-sulfonamide::US9586945, 17a
SMILES CN[C@@H]1COc2cc(F)c(cc2[C@@H]1Cc1ccccc1)N1CC(C1)NS(=O)(=O)c1cnn(C)c1
InChI Key InChIKey=SEBUFIINXAJFCL-SIKLNZKXSA-N
Data  1 KI
  Tab Delimited (TSV)   2D SDfile   Computed 3D by Vconf -m prep SDfile
Find this compound or compounds like it in BindingDB:
Activity Spreadsheet -- Enzyme Inhibition Constant Data from BindingDB
Found 1 hit for monomerid = 294263
TargetAlpha-1,3-mannosyl-glycoprotein 2-beta-N-acetylglucosaminyltransferase(Homo sapiens (Human))
Abbvie Deutschland
US Patent
LigandPNGBDBM294263( Cis-N-(1-(4-benzyl-7-fluoro-3-(methylamino)chroma...)
Affinity DataKi: <10nM. Assay description: 1. [3H]-Glycine uptake into recombinant CHO cells expressing human GlyT1: Human GlyT1c expressing recombinant hGlyT1c_5_CHO cells were plated at 20,0...
Ligand InfoPC cidPC sid
In DepthDetails US Patent