BDBM294275 Cis-1-(4-benzyl-7-fluoro-6-(3-(5-fluoropyridine-3-sulfonamido)azetidin-1-yl)chroman-3-yl)azetidin-1-ium (E)-3-carboxyacrylate::US9586945, 26
SMILES Fc1cncc(c1)S(=O)(=O)NC1CN(C1)c1cc2[C@H](Cc3ccccc3)[C@@H](COc2cc1F)[NH+]1CCC1
InChI Key InChIKey=SITJHRHZACERJP-BKMJKUGQSA-O
Data  1 KI
  Tab Delimited (TSV)   2D SDfile   Computed 3D by Vconf -m prep SDfile
Find this compound or compounds like it in BindingDB:
Activity Spreadsheet -- Enzyme Inhibition Constant Data from BindingDB
Found 1 hit for monomerid = 294275
TargetAlpha-1,3-mannosyl-glycoprotein 2-beta-N-acetylglucosaminyltransferase(Homo sapiens (Human))
Abbvie Deutschland
US Patent
LigandPNGBDBM294275(Cis-1-(4-benzyl-7-fluoro-6-(3-(5-fluoropyridine-3-...)
Affinity DataKi: <100nM. Assay description: 1. [3H]-Glycine uptake into recombinant CHO cells expressing human GlyT1: Human GlyT1c expressing recombinant hGlyT1c_5_CHO cells were plated at 20,0...
Ligand InfoPC cidPC sid
In DepthDetails US Patent