BDBM294314 US9586948, Example 33
SMILES CN1CCC=C(C1)c1cccc(n1)C(=O)Nc1cn(C)nc1C(N)=O
InChI Key InChIKey=LZGPAPUOVYCBIZ-UHFFFAOYSA-N
Data  1 IC50
  Tab Delimited (TSV)   2D SDfile   Computed 3D by Vconf -m prep SDfile
Find this compound or compounds like it in BindingDB:
Activity Spreadsheet -- Enzyme Inhibition Constant Data from BindingDB
Found 1 hit for monomerid = 294314
TargetInterleukin-1 receptor-associated kinase 4(Homo sapiens (Human))
Merck Sharp & Dohme
US Patent
LigandPNGBDBM294314(US9586948, Example 33)
Affinity DataIC50:  739nMpH: 7.2Assay Description:The kinase activity of IRAK4 is determined by its ability to catalyze the phosphorylation of a fluorescent polypeptide substrate. The extent of phosp...
Ligand InfoPC cidPC sid
In DepthDetails US Patent