BDBM294370 US9586959, Compound 20
SMILES C[C@H]1CN(CCN1C)c1nc2ncc(Cl)cc2n2cnnc12
InChI Key InChIKey=MLLMVCNLOSRTGN-VIFPVBQESA-N
Data  4 IC50
  Tab Delimited (TSV)   2D SDfile   Computed 3D by Vconf -m prep SDfile
Find this compound or compounds like it in BindingDB:
Activity Spreadsheet -- Enzyme Inhibition Constant Data from BindingDB
Found 4 hits for monomerid = 294370
TargetHistamine H4 receptor(Homo sapiens (Human))
C&C Research Laboratories
US Patent
LigandPNGBDBM294370(US9586959, Compound 20)
Affinity DataIC50:  380nMpH: 7.5 T: 2°C. Assay description: In vitro profiling protein kinases was performed using the HotSpot assay platform. Briefly, specific kinase/substrate pairs along with required cofac...
Ligand InfoPC cidPC sid
In DepthDetails US Patent
TargetHistamine H3 receptor(Homo sapiens (Human))
Sungkyunkwan University
Curated by ChEMBL
LigandPNGBDBM294370(US9586959, Compound 20)
Affinity DataIC50: >1.00E+5nM. Assay description: Displacement of [3H]-N-alpha-methylhistamine from recombinant human histamine H3 receptor expressed in CHO-K1 cell membranes measured after 30 mins b...
Ligand InfoPC cidPC sid
In DepthDetails ArticlePubMed
TargetHistamine H4 receptor(Homo sapiens (Human))
C&C Research Laboratories
US Patent
LigandPNGBDBM294370(US9586959, Compound 20)
Affinity DataIC50:  380nM. Assay description: Displacement of [3H]-histamine from recombinant human histamine H4 receptor expressed in CHO-K1 cell membranes measured after 30 mins by microbeta sc...
Ligand InfoPC cidPC sid
In DepthDetails ArticlePubMed
TargetHistamine H3 receptor(Homo sapiens (Human))
Sungkyunkwan University
Curated by ChEMBL
LigandPNGBDBM294370(US9586959, Compound 20)
Affinity DataIC50: >1.00E+8nMpH: 7.4 T: 2°C. Assay description: Each compound of the present invention prepared in the examples was prepared in DMSO into concentrations of 0.02, 0.06, 0.3 and 2 mM. 10 uL of the pr...
Ligand InfoPC cidPC sid
In DepthDetails US Patent