BDBM294423 US9586959, Compound 110
SMILES CNC1CN(C1)c1nc2ncc(Br)cc2c2ccnn12
InChI Key InChIKey=BUVFPBCXBVKVEI-UHFFFAOYSA-N
Data  2 IC50
  Tab Delimited (TSV)   2D SDfile   Computed 3D by Vconf -m prep SDfile
Find this compound or compounds like it in BindingDB:
Activity Spreadsheet -- Enzyme Inhibition Constant Data from BindingDB
Found 2 hits for monomerid = 294423
TargetHistamine H3 receptor(Homo sapiens (Human))
C&C Research Laboratories
US Patent
LigandPNGBDBM294423(US9586959, Compound 110)
Affinity DataIC50: >1.00E+8nMpH: 7.4 T: 2°C. Assay description: Each compound of the present invention prepared in the examples was prepared in DMSO into concentrations of 0.02, 0.06, 0.3 and 2 mM. 10 uL of the pr...
Ligand InfoPC cidPC sid
In DepthDetails US Patent
TargetHistamine H4 receptor(Homo sapiens (Human))
C&C Research Laboratories
US Patent
LigandPNGBDBM294423(US9586959, Compound 110)
Affinity DataIC50:  160nMpH: 7.5 T: 2°C. Assay description: In vitro profiling protein kinases was performed using the HotSpot assay platform. Briefly, specific kinase/substrate pairs along with required cofac...
Ligand InfoPC cidPC sid
In DepthDetails US Patent