BDBM294432 US9586959, Compound 8
SMILES NC1CN(C1)c1nc2ncc(Cl)cc2n2cnnc12
InChI Key InChIKey=HRGIIIWIMGJNML-UHFFFAOYSA-N
Data  3 IC50
  Tab Delimited (TSV)   2D SDfile   Computed 3D by Vconf -m prep SDfile
Find this compound or compounds like it in BindingDB:
Activity Spreadsheet -- Enzyme Inhibition Constant Data from BindingDB
Found 3 hits for monomerid = 294432
TargetHistamine H3 receptor(Homo sapiens (Human))
C&C Research Laboratories
US Patent
LigandPNGBDBM294432(US9586959, Compound 8)
Affinity DataIC50: >1.00E+8nMpH: 7.4 T: 2°C. Assay description: Each compound of the present invention prepared in the examples was prepared in DMSO into concentrations of 0.02, 0.06, 0.3 and 2 mM. 10 uL of the pr...
Ligand InfoPC cidPC sid
In DepthDetails US Patent
TargetHistamine H3 receptor(Homo sapiens (Human))
C&C Research Laboratories
US Patent
LigandPNGBDBM294432(US9586959, Compound 8)
Affinity DataIC50: >1.00E+5nM. Assay description: Displacement of [3H]-N-alpha-methylhistamine from recombinant human histamine H3 receptor expressed in CHO-K1 cell membranes measured after 30 mins b...
Ligand InfoPC cidPC sid
In DepthDetails ArticlePubMed
TargetHistamine H4 receptor(Homo sapiens (Human))
Sungkyunkwan University
Curated by ChEMBL
LigandPNGBDBM294432(US9586959, Compound 8)
Affinity DataIC50:  5.20E+3nM. Assay description: Displacement of [3H]-histamine from recombinant human histamine H4 receptor expressed in CHO-K1 cell membranes measured after 30 mins by microbeta sc...
Ligand InfoPC cidPC sid
In DepthDetails ArticlePubMed