BDBM294447 US9586959, Compound 44
SMILES CNC1CN(C1)c1nc2ncc(Cl)cc2c2cn(C)nc12
InChI Key InChIKey=QUDLOIFPNJDOEM-UHFFFAOYSA-N
Data  1 IC50
  Tab Delimited (TSV)   2D SDfile   Computed 3D by Vconf -m prep SDfile
Find this compound or compounds like it in BindingDB:
Activity Spreadsheet -- Enzyme Inhibition Constant Data from BindingDB
Found 1 hit for monomerid = 294447
TargetHistamine H3 receptor(Homo sapiens (Human))
C&C Research Laboratories
US Patent
LigandPNGBDBM294447(US9586959, Compound 44)
Affinity DataIC50: >1.00E+8nMpH: 7.4 T: 2°C. Assay description: Each compound of the present invention prepared in the examples was prepared in DMSO into concentrations of 0.02, 0.06, 0.3 and 2 mM. 10 uL of the pr...
Ligand InfoPC cidPC sid
In DepthDetails US Patent