BDBM294476 US9586959, Compound 114
SMILES CNC1CN(C1)c1nc2ncc(cc2n2cnnc12)-c1ccco1
InChI Key InChIKey=HCOFYFDBWVOHQU-UHFFFAOYSA-N
Data  1 IC50
  Tab Delimited (TSV)   2D SDfile   Computed 3D by Vconf -m prep SDfile
Find this compound or compounds like it in BindingDB:
Activity Spreadsheet -- Enzyme Inhibition Constant Data from BindingDB
Found 1 hit for monomerid = 294476
TargetHistamine H3 receptor(Homo sapiens (Human))
C&C Research Laboratories
US Patent
LigandPNGBDBM294476(US9586959, Compound 114)
Affinity DataIC50: >1.00E+8nMpH: 7.4 T: 2°C. Assay description: Each compound of the present invention prepared in the examples was prepared in DMSO into concentrations of 0.02, 0.06, 0.3 and 2 mM. 10 uL of the pr...
Ligand InfoPC cidPC sid
In DepthDetails US Patent