BDBM294512 5-[[2-[(4- chlorophenyl)methoxy]phenyl] methylamino]-1,3- dihydrobenzimidazol-2-one::US10112895, Compound 4
SMILES Clc1ccc(COc2ccccc2CNc2ccc3[nH]c(=O)[nH]c3c2)cc1
InChI Key InChIKey=KUUBTULWGFUPBI-UHFFFAOYSA-N
Data  1 EC50
  Tab Delimited (TSV)   2D SDfile   Computed 3D by Vconf -m prep SDfile
Find this compound or compounds like it in BindingDB:
Activity Spreadsheet -- Enzyme Inhibition Constant Data from BindingDB
Found 1 hit for monomerid = 294512
TargetUracil-DNA glycosylase(Vaccinia virus (strain Western Reserve) (VACV) (Va...)
University Of Pennsylvania
US Patent
LigandPNGBDBM294512(5-[[2-[(4- chlorophenyl)methoxy]phenyl] methylamin...)
Affinity DataEC50:  1.10E+4nMpH: 7.5Assay Description:Processive DNA synthesis was assessed by two types of assays: the Rapid Plate Assay and the M13 assay. The Rapid Plate Assay was performed as previou...
In DepthDetails US Patent