BDBM294974 US10112911, Example 1.39
SMILES CC(C)CC1CN(CCN1\C(Nc1ccccc1F)=N/C#N)c1cnc2ccccc2n1
InChI Key InChIKey=ZWRGNMNRGCMTML-UHFFFAOYSA-N
Data  1 EC50
  Tab Delimited (TSV)   2D SDfile   Computed 3D by Vconf -m prep SDfile
Find this compound or compounds like it in BindingDB:
Activity Spreadsheet -- Enzyme Inhibition Constant Data from BindingDB
Found 1 hit for monomerid = 294974
TargetProtein M2-1(Human respiratory syncytial virus A (strain A2))
Abbvie
US Patent
LigandPNGBDBM294974(US10112911, Example 1.39)
Affinity DataEC50: >1.00E+4nM. Assay description: A cytopathetic effect (CPE) protection assay was performed to determine the ability of a compound to protect the cells from viral infection and thus ...
Ligand InfoPC cidPC sid
In DepthDetails US Patent