BDBM294998 US10112911, Example 1.64
SMILES CC(C)C1CN(CCN1\C(Nc1ccccc1C)=N/C#N)c1nc(C)c(C)c(NC2CCCCC2)n1
InChI Key InChIKey=TYKQWHMNOQBWOJ-UHFFFAOYSA-N
Data  1 EC50
  Tab Delimited (TSV)   2D SDfile   Computed 3D by Vconf -m prep SDfile
Find this compound or compounds like it in BindingDB:
Activity Spreadsheet -- Enzyme Inhibition Constant Data from BindingDB
Found 1 hit for monomerid = 294998
TargetProtein M2-1(Human respiratory syncytial virus A (strain A2))
Abbvie
US Patent
LigandPNGBDBM294998(US10112911, Example 1.64)
Affinity DataEC50: >1.00E+4nM. Assay description: A cytopathetic effect (CPE) protection assay was performed to determine the ability of a compound to protect the cells from viral infection and thus ...
Ligand InfoPC cidPC sid
In DepthDetails US Patent