BDBM295012 US10112922, Compound 2
SMILES NC(=O)c1c(N)n(nc1-c1ccc(Oc2ccccc2)cc1)[C@@H]1CCN(C1)S(=O)(=O)C=C
InChI Key InChIKey=QAYKDNUKSKXNIL-MRXNPFEDSA-N
Data  2 IC50
  Tab Delimited (TSV)   2D SDfile   Computed 3D by Vconf -m prep SDfile
Find this compound or compounds like it in BindingDB:
Activity Spreadsheet -- Enzyme Inhibition Constant Data from BindingDB
Found 2 hits for monomerid = 295012
TargetTyrosine-protein kinase ITK/TSK(Homo sapiens (Human))
Centaurus Biopharma
US Patent
LigandPNGBDBM295012(US10112922, Compound 2)
Affinity DataIC50: <100nM. Assay description: In vitro activity in inhibiting ITK kinase was determined similar to that in respect of BTK kinase.The inhibitory activity of the compound of Example...
Ligand InfoPC cidPC sid
In DepthDetails US Patent
TargetTyrosine-protein kinase BTK(Homo sapiens (Human))
Centaurus Biopharma
US Patent
LigandPNGBDBM295012(US10112922, Compound 2)
Affinity DataIC50: <100nMpH: 7.4Assay Description:The half inhibition concentrations (IC50 values) of the compounds disclosed herein on Btk were determined at both enzymatic level and cellular level:...
Ligand InfoPC cidPC sid
In DepthDetails US Patent