BDBM295051 3-(6-Amino-5-(3-methylisoxazol-5-yl)pyridin-3-yl)-N-(2-hydroxy-2-methylpropyl)-4-methylbenzenesulfonamide::US10112926, Example 7
SMILES Cc1cc(on1)-c1cc(cnc1N)-c1cc(ccc1C)S(=O)(=O)NCC(C)(C)O
InChI Key InChIKey=PJSOHQYOAVQLMP-UHFFFAOYSA-N
Data  10 IC50
  Tab Delimited (TSV)   2D SDfile   Computed 3D by Vconf -m prep SDfile
Find this compound or compounds like it in BindingDB:
Activity Spreadsheet -- Enzyme Inhibition Constant Data from BindingDB
Found 10 hits for monomerid = 295051
TargetPhosphatidylinositol 3-kinase regulatory subunit alpha(Homo sapiens (Human))
Novartis
US Patent
LigandPNGBDBM295051(3-(6-Amino-5-(3-methylisoxazol-5-yl)pyridin-3-yl)-...)
Affinity DataIC50:  950nMpH: 7.5 T: 2°C. Assay description: The luminescence-based ATP detection reagent KinaseGlo was obtained from Promega, (Cat. No. V6714, Lot No. 236161) through Catalys, Wallisellen, Swit...
Ligand InfoPC cidPC sid
In DepthDetails US Patent
LigandPNGBDBM295051(3-(6-Amino-5-(3-methylisoxazol-5-yl)pyridin-3-yl)-...)
Affinity DataIC50:  3.80E+3nMpH: 7.5 T: 2°C. Assay description: The luminescence-based ATP detection reagent KinaseGlo was obtained from Promega, (Cat. No. V6714, Lot No. 236161) through Catalys, Wallisellen, Swit...
Ligand InfoPC cidPC sid
In DepthDetails US Patent
TargetPhosphatidylinositol 3-kinase catalytic subunit type 3(Homo sapiens (Human))
Novartis
US Patent
LigandPNGBDBM295051(3-(6-Amino-5-(3-methylisoxazol-5-yl)pyridin-3-yl)-...)
Affinity DataIC50: >1.00E+4nMpH: 7.5 T: 2°C. Assay description: The luminescence-based ATP detection reagent KinaseGlo was obtained from Promega, (Cat. No. V6714, Lot No. 236161) through Catalys, Wallisellen, Swit...
Ligand InfoPC cidPC sid
In DepthDetails US Patent
TargetPhosphatidylinositol 4-kinase beta(Homo sapiens (Human))
Novartis
US Patent
LigandPNGBDBM295051(3-(6-Amino-5-(3-methylisoxazol-5-yl)pyridin-3-yl)-...)
Affinity DataIC50:  3.98E+3nMpH: 7.5 T: 2°C. Assay description: The luminescence-based ATP detection reagent KinaseGlo was obtained from Promega, (Cat. No. V6714, Lot No. 236161) through Catalys, Wallisellen, Swit...
Ligand InfoPC cidPC sid
In DepthDetails US Patent
TargetPhosphatidylinositol 4,5-bisphosphate 3-kinase catalytic subunit gamma isoform(Homo sapiens (Human))
Novartis Institutes For Biomedical Research
Curated by ChEMBL
LigandPNGBDBM295051(3-(6-Amino-5-(3-methylisoxazol-5-yl)pyridin-3-yl)-...)
Affinity DataIC50:  110nM. Assay description: Inhibition of PI3Kgamma in human U937 cells assessed as reduction in AKT phosphorylation preincubated for 30 mins followed by MIP1alpha stimulation f...
Ligand InfoPC cidPC sid
In DepthDetails ArticlePubMed
LigandPNGBDBM295051(3-(6-Amino-5-(3-methylisoxazol-5-yl)pyridin-3-yl)-...)
Affinity DataIC50:  820nMpH: 7.5Assay Description:The TR-FRET Adapta Universal Kinase Assay Kit was purchased from Invitrogen Corporation (Carlsbad, Calif., USA) (Cat. No. PV5099). The kit contains t...
Ligand InfoPC cidPC sid
In DepthDetails US Patent
TargetSerine/threonine-protein kinase mTOR(Homo sapiens (Human))
Novartis
US Patent
LigandPNGBDBM295051(3-(6-Amino-5-(3-methylisoxazol-5-yl)pyridin-3-yl)-...)
Affinity DataIC50:  8.10E+3nMpH: 7.5Assay Description:Binding Assays are based on the binding and displacement of an Alexa Fluor 647-labeled, ATP-competitive kinase inhibitors to the kinase of interest. ...
Ligand InfoPC cidPC sid
In DepthDetails US Patent
TargetPhosphatidylinositol 4,5-bisphosphate 3-kinase catalytic subunit gamma isoform(Homo sapiens (Human))
Novartis Institutes For Biomedical Research
Curated by ChEMBL
LigandPNGBDBM295051(3-(6-Amino-5-(3-methylisoxazol-5-yl)pyridin-3-yl)-...)
Affinity DataIC50:  24nM. Assay description: Inhibition of PI3Kgamma (unknown origin) using phosphatidylinositol as substrate incubated for 30 to 60 mins in presence of ATP by TR-FRET based Adap...
Ligand InfoPC cidPC sid
In DepthDetails ArticlePubMed
TargetPhosphatidylinositol 4,5-bisphosphate 3-kinase catalytic subunit alpha isoform(Homo sapiens (Human))
Novartis Institutes For Biomedical Research
Curated by ChEMBL
LigandPNGBDBM295051(3-(6-Amino-5-(3-methylisoxazol-5-yl)pyridin-3-yl)-...)
Affinity DataIC50:  950nM. Assay description: Inhibition of PI3Kalpha (unknown origin) using L-alpha-phosphatidylinositol as substrate incubated for 30 to 60 mins in presence of ATP by Kinase Glo...
Ligand InfoPC cidPC sid
In DepthDetails ArticlePubMed
TargetPhosphatidylinositol 4,5-bisphosphate 3-kinase catalytic subunit gamma isoform(Homo sapiens (Human))
Novartis Institutes For Biomedical Research
Curated by ChEMBL
LigandPNGBDBM295051(3-(6-Amino-5-(3-methylisoxazol-5-yl)pyridin-3-yl)-...)
Affinity DataIC50:  24nMpH: 7.5Assay Description:The TR-FRET Adapta Universal Kinase Assay Kit was purchased from Invitrogen Corporation (Carlsbad, Calif., USA) (Cat. No. PV5099). The kit contains t...
Ligand InfoPC cidPC sid
In DepthDetails US Patent