BDBM295058 US10112926, Example 12::trans 3-[6-Amino-5-(3-methyl-[1,2,4]oxadiazol-5-yl)-pyridin-3-yl]-N-(4-hydroxy-cyclohexyl)-4-methyl-benzenesulfonamide, hydrochloride salt
SMILES Cc1noc(n1)-c1cc(cnc1N)-c1cc(ccc1C)S(=O)(=O)N[C@H]1CC[C@H](O)CC1
InChI Key InChIKey=XFGGNFBJRMXYAG-WKILWMFISA-N
Data  7 IC50
  Tab Delimited (TSV)   2D SDfile   Computed 3D by Vconf -m prep SDfile
Find this compound or compounds like it in BindingDB:
Activity Spreadsheet -- Enzyme Inhibition Constant Data from BindingDB
Found 7 hits for monomerid = 295058
TargetPhosphatidylinositol 3-kinase regulatory subunit alpha(Homo sapiens (Human))
Novartis
US Patent
LigandPNGBDBM295058(US10112926, Example 12 | trans 3-[6-Amino-5-(3-met...)
Affinity DataIC50:  160nMpH: 7.5 T: 2°C. Assay description: The luminescence-based ATP detection reagent KinaseGlo was obtained from Promega, (Cat. No. V6714, Lot No. 236161) through Catalys, Wallisellen, Swit...
Ligand InfoPC cidPC sid
In DepthDetails US Patent
LigandPNGBDBM295058(US10112926, Example 12 | trans 3-[6-Amino-5-(3-met...)
Affinity DataIC50:  230nMpH: 7.5 T: 2°C. Assay description: The luminescence-based ATP detection reagent KinaseGlo was obtained from Promega, (Cat. No. V6714, Lot No. 236161) through Catalys, Wallisellen, Swit...
Ligand InfoPC cidPC sid
In DepthDetails US Patent
TargetPhosphatidylinositol 3-kinase catalytic subunit type 3(Homo sapiens (Human))
Novartis
US Patent
LigandPNGBDBM295058(US10112926, Example 12 | trans 3-[6-Amino-5-(3-met...)
Affinity DataIC50: >1.00E+4nMpH: 7.5 T: 2°C. Assay description: The luminescence-based ATP detection reagent KinaseGlo was obtained from Promega, (Cat. No. V6714, Lot No. 236161) through Catalys, Wallisellen, Swit...
Ligand InfoPC cidPC sid
In DepthDetails US Patent
TargetSerine/threonine-protein kinase mTOR(Homo sapiens (Human))
Novartis
US Patent
LigandPNGBDBM295058(US10112926, Example 12 | trans 3-[6-Amino-5-(3-met...)
Affinity DataIC50: >1.00E+4nMpH: 7.5Assay Description:Binding Assays are based on the binding and displacement of an Alexa Fluor 647-labeled, ATP-competitive kinase inhibitors to the kinase of interest. ...
Ligand InfoPC cidPC sid
In DepthDetails US Patent
LigandPNGBDBM295058(US10112926, Example 12 | trans 3-[6-Amino-5-(3-met...)
Affinity DataIC50:  8nMpH: 7.5Assay Description:The TR-FRET Adapta Universal Kinase Assay Kit was purchased from Invitrogen Corporation (Carlsbad, Calif., USA) (Cat. No. PV5099). The kit contains t...
Ligand InfoPC cidPC sid
In DepthDetails US Patent
LigandPNGBDBM295058(US10112926, Example 12 | trans 3-[6-Amino-5-(3-met...)
Affinity DataIC50:  270nMpH: 7.5Assay Description:The TR-FRET Adapta Universal Kinase Assay Kit was purchased from Invitrogen Corporation (Carlsbad, Calif., USA) (Cat. No. PV5099). The kit contains t...
Ligand InfoPC cidPC sid
In DepthDetails US Patent
TargetPhosphatidylinositol 4-kinase beta(Homo sapiens (Human))
Novartis
US Patent
LigandPNGBDBM295058(US10112926, Example 12 | trans 3-[6-Amino-5-(3-met...)
Affinity DataIC50:  5.30E+3nMpH: 7.5 T: 2°C. Assay description: The luminescence-based ATP detection reagent KinaseGlo was obtained from Promega, (Cat. No. V6714, Lot No. 236161) through Catalys, Wallisellen, Swit...
Ligand InfoPC cidPC sid
In DepthDetails US Patent