BDBM295100 3-(6-Amino-5-(3-methylisoxazol-5-yl)pyridin-3-yl)-N-cyclopropyl-4-methylbenzenesulfonamide::US10112926, Example 31
SMILES Cc1cc(on1)-c1cc(cnc1N)-c1cc(ccc1C)S(=O)(=O)NC1CC1
InChI Key InChIKey=GJLUGKQXXSECIU-UHFFFAOYSA-N
Data  6 IC50
  Tab Delimited (TSV)   2D SDfile   Computed 3D by Vconf -m prep SDfile
Find this compound or compounds like it in BindingDB:
Activity Spreadsheet -- Enzyme Inhibition Constant Data from BindingDB
Found 6 hits for monomerid = 295100
TargetPhosphatidylinositol 3-kinase regulatory subunit alpha(Homo sapiens (Human))
Novartis
US Patent
LigandPNGBDBM295100(3-(6-Amino-5-(3-methylisoxazol-5-yl)pyridin-3-yl)-...)
Affinity DataIC50:  530nMpH: 7.5 T: 2°C. Assay description: The luminescence-based ATP detection reagent KinaseGlo was obtained from Promega, (Cat. No. V6714, Lot No. 236161) through Catalys, Wallisellen, Swit...
Ligand InfoPC cidPC sid
In DepthDetails US Patent
LigandPNGBDBM295100(3-(6-Amino-5-(3-methylisoxazol-5-yl)pyridin-3-yl)-...)
Affinity DataIC50:  3.63E+3nMpH: 7.5 T: 2°C. Assay description: The luminescence-based ATP detection reagent KinaseGlo was obtained from Promega, (Cat. No. V6714, Lot No. 236161) through Catalys, Wallisellen, Swit...
Ligand InfoPC cidPC sid
In DepthDetails US Patent
LigandPNGBDBM295100(3-(6-Amino-5-(3-methylisoxazol-5-yl)pyridin-3-yl)-...)
Affinity DataIC50:  740nMpH: 7.5Assay Description:The TR-FRET Adapta Universal Kinase Assay Kit was purchased from Invitrogen Corporation (Carlsbad, Calif., USA) (Cat. No. PV5099). The kit contains t...
Ligand InfoPC cidPC sid
In DepthDetails US Patent
TargetPhosphatidylinositol 4-kinase beta(Homo sapiens (Human))
Novartis
US Patent
LigandPNGBDBM295100(3-(6-Amino-5-(3-methylisoxazol-5-yl)pyridin-3-yl)-...)
Affinity DataIC50:  1.26E+3nMpH: 7.5 T: 2°C. Assay description: The luminescence-based ATP detection reagent KinaseGlo was obtained from Promega, (Cat. No. V6714, Lot No. 236161) through Catalys, Wallisellen, Swit...
Ligand InfoPC cidPC sid
In DepthDetails US Patent
LigandPNGBDBM295100(3-(6-Amino-5-(3-methylisoxazol-5-yl)pyridin-3-yl)-...)
Affinity DataIC50:  33nMpH: 7.5Assay Description:The TR-FRET Adapta Universal Kinase Assay Kit was purchased from Invitrogen Corporation (Carlsbad, Calif., USA) (Cat. No. PV5099). The kit contains t...
Ligand InfoPC cidPC sid
In DepthDetails US Patent
TargetPhosphatidylinositol 3-kinase catalytic subunit type 3(Homo sapiens (Human))
Novartis
US Patent
LigandPNGBDBM295100(3-(6-Amino-5-(3-methylisoxazol-5-yl)pyridin-3-yl)-...)
Affinity DataIC50: >1.00E+4nMpH: 7.5 T: 2°C. Assay description: The luminescence-based ATP detection reagent KinaseGlo was obtained from Promega, (Cat. No. V6714, Lot No. 236161) through Catalys, Wallisellen, Swit...
Ligand InfoPC cidPC sid
In DepthDetails US Patent