BDBM295211 3-(6-Amino-5-(5-methylthiazol-2-yl)pyridin-3-yl)-N-(2-hydroxy-2-methylpropyl)-4-methylbenzenesulfonamide::US10112926, Example 90
SMILES Cc1cnc(s1)-c1cc(cnc1N)-c1cc(ccc1C)S(=O)(=O)NCC(C)(C)O
InChI Key InChIKey=CICFFAJMTOTWDF-UHFFFAOYSA-N
Data  6 IC50
  Tab Delimited (TSV)   2D SDfile   Computed 3D by Vconf -m prep SDfile
Find this compound or compounds like it in BindingDB:
Activity Spreadsheet -- Enzyme Inhibition Constant Data from BindingDB
Found 6 hits for monomerid = 295211
TargetPhosphatidylinositol 3-kinase regulatory subunit alpha(Homo sapiens (Human))
Novartis
US Patent
LigandPNGBDBM295211(3-(6-Amino-5-(5-methylthiazol-2-yl)pyridin-3-yl)-N...)
Affinity DataIC50:  160nMpH: 7.5 T: 2°C. Assay description: The luminescence-based ATP detection reagent KinaseGlo was obtained from Promega, (Cat. No. V6714, Lot No. 236161) through Catalys, Wallisellen, Swit...
Ligand InfoPC cidPC sid
In DepthDetails US Patent
LigandPNGBDBM295211(3-(6-Amino-5-(5-methylthiazol-2-yl)pyridin-3-yl)-N...)
Affinity DataIC50:  880nMpH: 7.5 T: 2°C. Assay description: The luminescence-based ATP detection reagent KinaseGlo was obtained from Promega, (Cat. No. V6714, Lot No. 236161) through Catalys, Wallisellen, Swit...
Ligand InfoPC cidPC sid
In DepthDetails US Patent
LigandPNGBDBM295211(3-(6-Amino-5-(5-methylthiazol-2-yl)pyridin-3-yl)-N...)
Affinity DataIC50:  320nMpH: 7.5Assay Description:The TR-FRET Adapta Universal Kinase Assay Kit was purchased from Invitrogen Corporation (Carlsbad, Calif., USA) (Cat. No. PV5099). The kit contains t...
Ligand InfoPC cidPC sid
In DepthDetails US Patent
TargetPhosphatidylinositol 4-kinase beta(Homo sapiens (Human))
Novartis
US Patent
LigandPNGBDBM295211(3-(6-Amino-5-(5-methylthiazol-2-yl)pyridin-3-yl)-N...)
Affinity DataIC50:  750nMpH: 7.5 T: 2°C. Assay description: The luminescence-based ATP detection reagent KinaseGlo was obtained from Promega, (Cat. No. V6714, Lot No. 236161) through Catalys, Wallisellen, Swit...
Ligand InfoPC cidPC sid
In DepthDetails US Patent
LigandPNGBDBM295211(3-(6-Amino-5-(5-methylthiazol-2-yl)pyridin-3-yl)-N...)
Affinity DataIC50:  12nMpH: 7.5Assay Description:The TR-FRET Adapta Universal Kinase Assay Kit was purchased from Invitrogen Corporation (Carlsbad, Calif., USA) (Cat. No. PV5099). The kit contains t...
Ligand InfoPC cidPC sid
In DepthDetails US Patent
TargetPhosphatidylinositol 3-kinase catalytic subunit type 3(Homo sapiens (Human))
Novartis
US Patent
LigandPNGBDBM295211(3-(6-Amino-5-(5-methylthiazol-2-yl)pyridin-3-yl)-N...)
Affinity DataIC50: >1.00E+4nMpH: 7.5 T: 2°C. Assay description: The luminescence-based ATP detection reagent KinaseGlo was obtained from Promega, (Cat. No. V6714, Lot No. 236161) through Catalys, Wallisellen, Swit...
Ligand InfoPC cidPC sid
In DepthDetails US Patent