BDBM295284 6-(2- aminoethylamino)-4- (2-tert- butylpyrimidin-4- ylamino)pyridazine- 3-carboxamide::US10112928, Compound I-28
SMILES CC(C)(C)c1nccc(Nc2cc(NCCN)nnc2C(N)=O)n1
InChI Key InChIKey=KOIMMIZIJCOSIB-UHFFFAOYSA-N
Data  1 IC50
  Tab Delimited (TSV)   2D SDfile   Computed 3D by Vconf -m prep SDfile
Find this compound or compounds like it in BindingDB:
Activity Spreadsheet -- Enzyme Inhibition Constant Data from BindingDB
Found 1 hit for monomerid = 295284
TargetTyrosine-protein kinase SYK [360-635](Homo sapiens (Human))
Hoffmann-La Roche
US Patent
LigandPNGBDBM295284(6-(2- aminoethylamino)-4- (2-tert- butylpyrimidin-...)
Affinity DataIC50:  170nMpH: 7.5Assay Description:SYK kinase assay is a standard kinase assay adapted to a 96 well plate format. This assay is performed in 96-well format for IC50 determination with ...
Ligand InfoPC cidPC sid
In DepthDetails US Patent