BDBM295674 Example 1 in WO2010036630::US11084810, Example 1 in WO2010036630::US11725004, Example 1 in WO2010036630
SMILES CC(C)(CO)c1cc(NC(=O)C(C)(C)S(=O)(=O)CC2CCOCC2)on1
InChI Key InChIKey=BLBSAOGDKLRDIM-UHFFFAOYSA-N
Data  1 IC50  5 EC50
  Tab Delimited (TSV)   2D SDfile   Computed 3D by Vconf -m prep SDfile
Find this compound or compounds like it in BindingDB:
Activity Spreadsheet -- Enzyme Inhibition Constant Data from BindingDB
Found 6 hits for monomerid = 295674
TargetCannabinoid receptor 2(Homo sapiens (Human))
Centrexion Therapeutics
US Patent
LigandPNGBDBM295674(Example 1 in WO2010036630 | US11084810, Example 1 ...)
Affinity DataEC50:  88nM. Assay description: CHO cells expressing human CB2R (Euroscreen) were plated at a density of 10,000 cells per well in 384 well plates and incubated overnight at 37° C. A...
Ligand InfoPC cidPC sid
In DepthDetails US Patent
TargetCannabinoid receptor 1(Homo sapiens (Human))
Centrexion Therapeutics
US Patent
LigandPNGBDBM295674(Example 1 in WO2010036630 | US11084810, Example 1 ...)
Affinity DataEC50:  5.00E+4nM. Assay description: CHO cells expressing human CB1R (Euroscreen) were plated at a density of 10,000 cells per well in 384 well plates and incubated overnight at 37° C. A...
Ligand InfoPC cidPC sid
In DepthDetails US Patent
TargetCannabinoid receptor 1(Homo sapiens (Human))
Centrexion Therapeutics
US Patent
LigandPNGBDBM295674(Example 1 in WO2010036630 | US11084810, Example 1 ...)
Affinity DataIC50: >5.00E+4nM. Assay description: CHO cells expressing human CB1R (Euroscreen) were plated at a density of 10,000 cells per well in 384 well plates and incubated overnight at 37° C. A...
Ligand InfoPC cidPC sid
In DepthDetails US Patent
TargetCannabinoid receptor 1(Homo sapiens (Human))
Centrexion Therapeutics
US Patent
LigandPNGBDBM295674(Example 1 in WO2010036630 | US11084810, Example 1 ...)
Affinity DataEC50: >5.00E+4nM. Assay description: CHO cells expressing human CB1 R (Euroscreen) were plated at a density of 10,000 cells per well in 384 well plates and incubated overnight at 37° C. ...
Ligand InfoPC cidPC sid
In DepthDetails US Patent
TargetCannabinoid receptor 2(Homo sapiens (Human))
Centrexion Therapeutics
US Patent
LigandPNGBDBM295674(Example 1 in WO2010036630 | US11084810, Example 1 ...)
Affinity DataEC50:  88nM. Assay description: CHO cells expressing human CB2R (Euroscreen) were plated at a density of 10,000 cells per well in 384 well plates and incubated overnight at 37° C. A...
Ligand InfoPC cidPC sid
In DepthDetails US Patent
TargetCannabinoid receptor 2(Homo sapiens (Human))
Centrexion Therapeutics
US Patent
LigandPNGBDBM295674(Example 1 in WO2010036630 | US11084810, Example 1 ...)
Affinity DataEC50:  88nM. Assay description: CHO cells expressing human CB2R (Euroscreen) were plated at a density of 10,000 cells per well in 384 well plates and incubated overnight at 37° C. A...
Ligand InfoPC cidPC sid
In DepthDetails US Patent