BDBM295786 US10112935, Compound 35AH
SMILES CC(C(=O)Nc1cccc(c1)-c1nnc(Nc2ccc3[nH]ncc3c2Cl)s1)c1ccccn1
InChI Key
Data  2 IC50
  Tab Delimited (TSV)   2D SDfile   Computed 3D by Vconf -m prep SDfile
Find this compound or compounds like it in BindingDB:
Activity Spreadsheet -- Enzyme Inhibition Constant Data from BindingDB
Found 2 hits for monomerid = 295786
TargetRho-associated protein kinase 2(Homo sapiens (Human))
Lycera
US Patent
LigandPNGBDBM295786(US10112935, Compound 35AH)
Affinity DataIC50: <1.00E+3nMT: 2°C. Assay description: Assays for ROCK inhibition were performed using the following protein constructs: glutathione S-transferase (GST)-tagged human ROCK1 catalytic domain...
Ligand InfoPC cidPC sid
In DepthDetails US Patent
TargetRho-associated protein kinase 1(Homo sapiens (Human))
Lycera
US Patent
LigandPNGBDBM295786(US10112935, Compound 35AH)
Affinity DataIC50: <1.00E+3nMT: 2°C. Assay description: Assays for ROCK inhibition were performed using the following protein constructs: glutathione S-transferase (GST)-tagged human ROCK1 catalytic domain...
Ligand InfoPC cidPC sid
In DepthDetails US Patent