BDBM296016 3-[(2R)-4-hydroxy-1-[3- methoxy-4-(1H-pyrazol- 4-yl)benzoyl]pyrrolidin- 2-yl]-N-(oxan-4- yl)benzamide::US10112939, Example 56
SMILES COc1cc(ccc1-c1cn[nH]c1)C(=O)N1CC(O)C[C@@H]1c1cccc(c1)C(=O)NC1CCOCC1
InChI Key
Data  1 IC50
  Tab Delimited (TSV)   2D SDfile   Computed 3D by Vconf -m prep SDfile
Find this compound or compounds like it in BindingDB:
Activity Spreadsheet -- Enzyme Inhibition Constant Data from BindingDB
Found 1 hit for monomerid = 296016
TargetRho-associated protein kinase 2(Homo sapiens (Human))
Bristol-Myers Squibb
US Patent
LigandPNGBDBM296016(3-[(2R)-4-hydroxy-1-[3- methoxy-4-(1H-pyrazol- 4-y...)
Affinity DataIC50:  7.17nMpH: 7.5Assay Description:The effectiveness of compounds of the present invention as ROCK inhibitors can be determined in a 30 μL assay containing 20 mM HEPES, pH 7.5, 20...
Ligand InfoPC cidPC sid
In DepthDetails US Patent