BDBM296042 US10112939, Example 81
SMILES COc1cccc(c1)C1CCCN1C(=O)c1ccc(c(OC)c1)-c1ccnc(N)c1
InChI Key InChIKey=DOZKTKXNIQDCCP-UHFFFAOYSA-N
Data  1 IC50
  Tab Delimited (TSV)   2D SDfile   Computed 3D by Vconf -m prep SDfile
Find this compound or compounds like it in BindingDB:
Activity Spreadsheet -- Enzyme Inhibition Constant Data from BindingDB
Found 1 hit for monomerid = 296042
TargetRho-associated protein kinase 2(Homo sapiens (Human))
Bristol-Myers Squibb
US Patent
LigandPNGBDBM296042(US10112939, Example 81)
Affinity DataIC50:  158nMpH: 7.5Assay Description:The effectiveness of compounds of the present invention as ROCK inhibitors can be determined in a 30 μL assay containing 20 mM HEPES, pH 7.5, 20...
Ligand InfoPC cidPC sid
In DepthDetails US Patent