BDBM29634 1-(2-methyl-1H-perimidin-4-yl)ethanone::1-(2-methyl-1H-perimidin-9-yl)ethanone::MLS000089784::SMR000024402::cid_5771339
SMILES CC(=O)c1ccc2cccc3nc(C)[nH]c1c23
InChI Key InChIKey=LBFIMGGLFHIMIU-UHFFFAOYSA-N
Data  2 IC50  3 EC50
  Tab Delimited (TSV)   2D SDfile   Computed 3D by Vconf -m prep SDfile
Find this compound or compounds like it in BindingDB:
Activity Spreadsheet -- Enzyme Inhibition Constant Data from BindingDB
Found 5 hits for monomerid = 29634
TargetRunt-related transcription factor 1(Homo sapiens (Human))
Burnham Center For Chemical Genomics
Curated by PubChem BioAssay
LigandPNGBDBM29634(1-(2-methyl-1H-perimidin-4-yl)ethanone | 1-(2-meth...)
Affinity DataIC50:  1.00E+5nMpH: 7.4 T: 2°C. Assay description: This assay is to use HTS to identify inhibitors of the protein-protein interaction between the RUNX1 Runt domain and CBFbeta-SMMHC, a potential thera...
In DepthDetails PCBioAssay
TargetRunt-related transcription factor 1(Homo sapiens (Human))
Burnham Center For Chemical Genomics
Curated by PubChem BioAssay
LigandPNGBDBM29634(1-(2-methyl-1H-perimidin-4-yl)ethanone | 1-(2-meth...)
Affinity DataIC50:  1.00E+5nMpH: 7.4 T: 2°C. Assay description: This assay is to identify inhibitors of the protein-protein interaction between the RUNX1 Runt domain and CBFbeta-SMMHC. This is accomplished by usin...
In DepthDetails PCBioAssay
TargetTropomyosin alpha-1 chain(Sus scrofa)
The Scripps Research Institute Molecular Screening Center
Curated by PubChem BioAssay
LigandPNGBDBM29634(1-(2-methyl-1H-perimidin-4-yl)ethanone | 1-(2-meth...)
Affinity DataEC50:  1.73E+4nM. Assay description: Source (MLPCN Center Name): The Scripps Research Institute Molecular Screening Center (SRIMSC) Affiliation: The Scripps Research Institute, TSRI Assa...
In DepthDetails PCBioAssay
TargetZinc finger protein mex-5(Caenorhabditis elegans)
Broad Institute
Curated by PubChem BioAssay
LigandPNGBDBM29634(1-(2-methyl-1H-perimidin-4-yl)ethanone | 1-(2-meth...)
Affinity DataEC50:  6.57E+3nM. Assay description: Broad Institute: MLPCN maternal gene expression Project ID: 2024 Keywords: Zinc finger, C. elegans, maternal gene expression, RNA-protein interac...
In DepthDetails PCBioAssay
TargetPOsterior Segregation(Caenorhabditis elegans)
Broad Institute
Curated by PubChem BioAssay
LigandPNGBDBM29634(1-(2-methyl-1H-perimidin-4-yl)ethanone | 1-(2-meth...)
Affinity DataEC50:  9.79E+3nM. Assay description: Broad Institute: MLPCN maternal gene expression Project ID: 2024 Keywords: Zinc finger, C. elegans, maternal gene expression, RNA-protein interac...
In DepthDetails PCBioAssay