BDBM29696 1-[(4-methylphenyl)methyl]-3-(phenylmethyl)urea::1-benzyl-3-(4-methylbenzyl)urea::1-benzyl-3-[(4-methylphenyl)methyl]urea::MLS001001984::SMR000353323::cid_2313118
SMILES Cc1ccc(CNC(=O)NCc2ccccc2)cc1
InChI Key InChIKey=BDFGAYSJHXBRRO-UHFFFAOYSA-N
Data  2 IC50
  Tab Delimited (TSV)   2D SDfile   Computed 3D by Vconf -m prep SDfile
Find this compound or compounds like it in BindingDB:
Activity Spreadsheet -- Enzyme Inhibition Constant Data from BindingDB
Found 2 hits for monomerid = 29696
TargetRunt-related transcription factor 1(Homo sapiens (Human))
Burnham Center For Chemical Genomics
Curated by PubChem BioAssay
LigandPNGBDBM29696(1-[(4-methylphenyl)methyl]-3-(phenylmethyl)urea | ...)
Affinity DataIC50:  1.00E+5nMpH: 7.4 T: 2°C. Assay description: This assay is to use HTS to identify inhibitors of the protein-protein interaction between the RUNX1 Runt domain and CBFbeta-SMMHC, a potential thera...
In DepthDetails PCBioAssay
TargetRunt-related transcription factor 1(Homo sapiens (Human))
Burnham Center For Chemical Genomics
Curated by PubChem BioAssay
LigandPNGBDBM29696(1-[(4-methylphenyl)methyl]-3-(phenylmethyl)urea | ...)
Affinity DataIC50:  1.00E+5nMpH: 7.4 T: 2°C. Assay description: This assay is to identify inhibitors of the protein-protein interaction between the RUNX1 Runt domain and CBFbeta-SMMHC. This is accomplished by usin...
In DepthDetails PCBioAssay