BDBM296979 US10112941, Example 86
SMILES Cc1noc(C)c1-c1cnc2c(c1)n([C@@H](CCC(F)(F)F)c1ccccc1Cl)c1cc(ccc21)C(C)(C)O
InChI Key InChIKey=YZCAWGYIHJQIIJ-QHCPKHFHSA-N
Data  1 IC50
  Tab Delimited (TSV)   2D SDfile   Computed 3D by Vconf -m prep SDfile
Find this compound or compounds like it in BindingDB:
Activity Spreadsheet -- Enzyme Inhibition Constant Data from BindingDB
Found 1 hit for monomerid = 296979
TargetBromodomain-containing protein 4(Homo sapiens (Human))
Bristol-Myers Squibb
US Patent
LigandPNGBDBM296979(US10112941, Example 86)
Affinity DataIC50: <5nM. Assay description: All assay components were dissolved in buffer composition 20 mM Hepes pH 7.5, 150 mM NaCl, 5 mM DTT, 0.005% Tween 20, and 100 ug/ml BSA for BRD4 (1-4...
Ligand InfoPC cidPC sid
In DepthDetails US Patent