BDBM29704 Pyridoimidazolone, 5d
SMILES FC(F)(F)c1cc(Cl)cc(NC(=O)Nc2ccc(Oc3ccnc4[nH]c(=O)[nH]c34)cc2)c1
InChI Key InChIKey=GBYRDHGWZPNCKO-UHFFFAOYSA-N
Data  1 IC50
  Tab Delimited (TSV)   2D SDfile   Computed 3D by Vconf -m prep SDfile
Find this compound or compounds like it in BindingDB:
Activity Spreadsheet -- Enzyme Inhibition Constant Data from BindingDB
Found 1 hit for monomerid = 29704
TargetSerine/threonine-protein kinase B-raf [V600E](Homo sapiens (Human))
The Institute Of Cancer Research
LigandPNGBDBM29704(Pyridoimidazolone, 5d)
Affinity DataIC50:  100nMpH: 7.2 T: 2°C. Assay description: The biological activities (IC50s) of the compounds were determined against the B-RAF (V600E) mutant enzyme in vitro. GST-MEK1, B-RAF (V600E), and inh...
In DepthDetails ArticlePubMed