BDBM29720 Pyridoimidazolone, 5t
SMILES Cn1c2nccc(Oc3ccc(NC(=O)Nc4ccc(Cl)c(c4)C(F)(F)F)cc3)c2n(C)c1=O
InChI Key InChIKey=KWWVGZNBKXWGIS-UHFFFAOYSA-N
Data  1 IC50
  Tab Delimited (TSV)   2D SDfile   Computed 3D by Vconf -m prep SDfile
Find this compound or compounds like it in BindingDB:
Activity Spreadsheet -- Enzyme Inhibition Constant Data from BindingDB
Found 1 hit for monomerid = 29720
TargetSerine/threonine-protein kinase B-raf [V600E](Homo sapiens (Human))
The Institute Of Cancer Research
LigandPNGBDBM29720(Pyridoimidazolone, 5t)
Affinity DataIC50:  61nMpH: 7.2 T: 2°C. Assay description: The biological activities (IC50s) of the compounds were determined against the B-RAF (V600E) mutant enzyme in vitro. GST-MEK1, B-RAF (V600E), and inh...
In DepthDetails ArticlePubMed