BDBM297261 2-[8-Chloro-3-(4-chloro-1-methyl-1H-1,2,3-triazol-5-yl)-5-[(S)-oxan-4-yl(phenyl)methyl]-5H-pyrido[3,2-b]indol-7-yl]propan-2-ol, and 2-[3-(4-Chloro-1-methyl-1H-1,2,3-triazol-5-yl)-5-[(S)-oxan-4-yl(phenyl)methyl]-5H-pyrido[3,2-b]indol-7-yl]propan-2-ol::US10112941, Example 386::US10112941, Example 387
SMILES Cn1nnc(Cl)c1-c1cnc2c(c1)n([C@@H](C1CCOCC1)c1ccccc1)c1cc(c(Cl)cc21)C(C)(C)O
InChI Key InChIKey=MTHUOJYSBNXEKE-AREMUKBSSA-N
Data  2 IC50
  Tab Delimited (TSV)   2D SDfile   Computed 3D by Vconf -m prep SDfile
Find this compound or compounds like it in BindingDB:
Activity Spreadsheet -- Enzyme Inhibition Constant Data from BindingDB
Found 2 hits for monomerid = 297261
TargetBromodomain-containing protein 4(Homo sapiens (Human))
Bristol-Myers Squibb
US Patent
LigandPNGBDBM297261(2-[8-Chloro-3-(4-chloro-1-methyl-1H-1,2,3-triazol-...)
Affinity DataIC50: <5nM. Assay description: All assay components were dissolved in buffer composition 20 mM Hepes pH 7.5, 150 mM NaCl, 5 mM DTT, 0.005% Tween 20, and 100 ug/ml BSA for BRD4 (1-4...
Ligand InfoPC cidPC sid
In DepthDetails US Patent
TargetBromodomain-containing protein 4(Homo sapiens (Human))
Bristol-Myers Squibb
US Patent
LigandPNGBDBM297261(2-[8-Chloro-3-(4-chloro-1-methyl-1H-1,2,3-triazol-...)
Affinity DataIC50: <5nM. Assay description: All assay components were dissolved in buffer composition 20 mM Hepes pH 7.5, 150 mM NaCl, 5 mM DTT, 0.005% Tween 20, and 100 ug/ml BSA for BRD4 (1-4...
Ligand InfoPC cidPC sid
In DepthDetails US Patent