BDBM297266 5-{7-Methanesulfonyl-5-[(S)-oxan-4-yl(phenyl)methyl]-5H-pyrido[3,2-b]indol-3-yl}-4-methoxy-1-methyl-1H-1,2,3-triazole::US10112941, Example 391
SMILES COc1nnn(C)c1-c1cnc2c(c1)n([C@@H](C1CCOCC1)c1ccccc1)c1cc(ccc21)S(C)(=O)=O
InChI Key InChIKey=RLXUBJLRVMWJTK-AREMUKBSSA-N
Data  1 IC50
  Tab Delimited (TSV)   2D SDfile   Computed 3D by Vconf -m prep SDfile
Find this compound or compounds like it in BindingDB:
Activity Spreadsheet -- Enzyme Inhibition Constant Data from BindingDB
Found 1 hit for monomerid = 297266
TargetBromodomain-containing protein 4(Homo sapiens (Human))
Bristol-Myers Squibb
US Patent
LigandPNGBDBM297266(5-{7-Methanesulfonyl-5-[(S)-oxan-4-yl(phenyl)methy...)
Affinity DataIC50: <5nM. Assay description: All assay components were dissolved in buffer composition 20 mM Hepes pH 7.5, 150 mM NaCl, 5 mM DTT, 0.005% Tween 20, and 100 ug/ml BSA for BRD4 (1-4...
Ligand InfoPC cidPC sid
In DepthDetails US Patent