BDBM297349 N-(6-((3-methyl-1-oxoisoindolin-5-yl)amino)pyrimidin-4-yl)cyclopropanecarboxamide (Cpd. No. 17)::US10112955, Example 17
SMILES CC1NC(=O)c2ccc(Nc3cc(NC(=O)C4CC4)ncn3)cc12
InChI Key InChIKey=XTDVNWGYGGANTH-UHFFFAOYSA-N
Data  2 IC50
  Tab Delimited (TSV)   2D SDfile   Computed 3D by Vconf -m prep SDfile
Find this compound or compounds like it in BindingDB:
Activity Spreadsheet -- Enzyme Inhibition Constant Data from BindingDB
Found 2 hits for monomerid = 297349
TargetMAP kinase-interacting serine/threonine-protein kinase 2(Homo sapiens (Human))
Effector Therapeutics
US Patent
LigandPNGBDBM297349(N-(6-((3-methyl-1-oxoisoindolin-5-yl)amino)pyrimid...)
Affinity DataIC50: <10nM
Ligand InfoPC cidPC sid
In DepthDetails US Patent
TargetMAP kinase-interacting serine/threonine-protein kinase 1(Homo sapiens (Human))
Effector Therapeutics
US Patent
LigandPNGBDBM297349(N-(6-((3-methyl-1-oxoisoindolin-5-yl)amino)pyrimid...)
Affinity DataIC50: <10nM. Assay description: Compounds are screened for MNK inhibition using the ADP-Glo kinase assay kit (Promega, catalogue No. V9101). All kinase reactions are performed in Re...
Ligand InfoPC cidPC sid
In DepthDetails US Patent