BDBM297357 3-methyl-5-((2-(methyl amino) pyridin-4-yl) amino) isoindolin-1-one (Cpd. No. 25)::US10112955, Example 25
SMILES CNc1cc(Nc2ccc3C(=O)NC(C)c3c2)ccn1
InChI Key InChIKey=SNCFCFMENPRQTN-UHFFFAOYSA-N
Data  1 IC50
  Tab Delimited (TSV)   2D SDfile   Computed 3D by Vconf -m prep SDfile
Find this compound or compounds like it in BindingDB:
Activity Spreadsheet -- Enzyme Inhibition Constant Data from BindingDB
Found 1 hit for monomerid = 297357
TargetMAP kinase-interacting serine/threonine-protein kinase 2(Homo sapiens (Human))
Effector Therapeutics
US Patent
LigandPNGBDBM297357(3-methyl-5-((2-(methyl amino) pyridin-4-yl) amino)...)
Affinity DataIC50:  5.05E+3nM
Ligand InfoPC cidPC sid
In DepthDetails US Patent