BDBM297387 6'-((6-amino-5-chloropyrimidin-4-yl)amino)-4'-methylspiro[cyclohexane-1,1'-isoindolin]-3'-one (Cpd. No. 58)::US10112955, Example 58
SMILES Cc1cc(Nc2ncnc(N)c2Cl)cc2c1C(=O)NC21CCCCC1
InChI Key InChIKey=FIOYHBCPYRHWNY-UHFFFAOYSA-N
Data  1 IC50
  Tab Delimited (TSV)   2D SDfile   Computed 3D by Vconf -m prep SDfile
Find this compound or compounds like it in BindingDB:
Activity Spreadsheet -- Enzyme Inhibition Constant Data from BindingDB
Found 1 hit for monomerid = 297387
TargetMAP kinase-interacting serine/threonine-protein kinase 2(Homo sapiens (Human))
Effector Therapeutics
US Patent
LigandPNGBDBM297387(6'-((6-amino-5-chloropyrimidin-4-yl)amino)-4'-meth...)
Affinity DataIC50: <10nM
Ligand InfoPC cidPC sid
In DepthDetails US Patent