BDBM297421 4-({[6-Bromo-2-(3-chlorophenyl)-3-methylquinolin-4-yl]carbonyl}amino)bicyclo[2.2.2]octane-1-carboxylic acid::US10117864, Example 11
SMILES Cc1c(nc2ccc(Br)cc2c1C(=O)NC12CCC(CC1)(CC2)C(O)=O)-c1cccc(Cl)c1
InChI Key InChIKey=FUIDZWDZAMBQCV-UHFFFAOYSA-N
Data  1 IC50
  Tab Delimited (TSV)   2D SDfile   Computed 3D by Vconf -m prep SDfile
Find this compound or compounds like it in BindingDB:
Activity Spreadsheet -- Enzyme Inhibition Constant Data from BindingDB
Found 1 hit for monomerid = 297421
TargetProstaglandin F2-alpha receptor(Homo sapiens (Human))
Bayer Pharma Aktiengesellschaft
US Patent
LigandPNGBDBM297421(4-({[6-Bromo-2-(3-chlorophenyl)-3-methylquinolin-4...)
Affinity DataIC50:  129nM. Assay description: For the characterization of test substances in respect of FP antagonism, PGF2α-induced calcium flux in FP-expressing CHEM1 cells (Millipore, HTS...
Ligand InfoPC cidPC sid
In DepthDetails US Patent