BDBM297491 US10117944, Compound SDC-TRAP-0242
SMILES CC(C)C[C@H](NC(=O)[C@H](Cc1ccccc1)NC(=O)c1cnccn1)B1OC(C)(C)C(C)(O1)c1ccc(cc1)C(=O)N1CCC(COc2ccc(cc2)-n2c(O)nnc2-c2cc(C(C)C)c(O)cc2O)CC1
InChI Key InChIKey=MVOTXSVDLGESOV-QCAINQIKSA-N
Data  1 IC50
  Tab Delimited (TSV)   2D SDfile   Computed 3D by Vconf -m prep SDfile
Find this compound or compounds like it in BindingDB:
Activity Spreadsheet -- Enzyme Inhibition Constant Data from BindingDB
Found 1 hit for monomerid = 297491
TargetReceptor tyrosine-protein kinase erbB-2(Homo sapiens (Human))
Madrigal Pharmaceuticals
US Patent
LigandPNGBDBM297491(US10117944, Compound SDC-TRAP-0242)
Affinity DataIC50:  407nM. Assay description: HER2 has emerged as a key target for anticancer drugs due to its intrinsic involvement in the phosphatidylinositol-3-kinase-Akt/protein kinase B (PI3...
Ligand InfoPC cidPC sid
In DepthDetails US Patent