BDBM29754 macrocyclic peptidomimetic, 3h
SMILES CCCCNC(=O)[C@H](C)C[C@H](O)[C@@H]1C[C@H](C)CCCCCCCCC(=O)N(C)[C@@H](C)C(=O)N1
InChI Key InChIKey=WOSHLTWGKJOHON-VROINQGHSA-N
Data  5 IC50
  Tab Delimited (TSV)   2D SDfile   Computed 3D by Vconf -m prep SDfile
Find this compound or compounds like it in BindingDB:
Activity Spreadsheet -- Enzyme Inhibition Constant Data from BindingDB
Found 5 hits for monomerid = 29754
TargetBeta-secretase 1 [1-453](Homo sapiens (Human))
Novartis
LigandPNGBDBM29754(macrocyclic peptidomimetic, 3h)
Affinity DataIC50:  150nMpH: 4.5 T: 2°C. Assay description: Inhibition assays were done in black 96-well plates by adding test compounds to the respective enzyme in assay buffer. Plates were incubated at room ...
In DepthDetails ArticlePubMed
TargetCathepsin D(Homo sapiens (Human))
Novartis
LigandPNGBDBM29754(macrocyclic peptidomimetic, 3h)
Affinity DataIC50:  8.10E+3nMpH: 3.1 T: 2°C. Assay description: Inhibition assays were done in black 96-well plates by adding test compounds to the respective enzyme in assay buffer. Plates were incubated at room ...
In DepthDetails ArticlePubMed
TargetCathepsin D(Homo sapiens (Human))
Novartis
LigandPNGBDBM29754(macrocyclic peptidomimetic, 3h)
Affinity DataIC50:  8.10E+3nM. Assay description: Inhibition of human cathepsin D
In DepthDetails ArticlePubMed
TargetBeta-secretase 1(Homo sapiens (Human))
Novartis Institutes For Biomedical Research
Curated by ChEMBL
LigandPNGBDBM29754(macrocyclic peptidomimetic, 3h)
Affinity DataIC50:  8.70E+3nM. Assay description: Inhibition of BACE1 expressed in CHO cells expressing human recombinant APP assessed as amyloid beta40 aggregation
In DepthDetails ArticlePubMed
TargetBeta-secretase 1(Homo sapiens (Human))
Novartis Institutes For Biomedical Research
Curated by ChEMBL
LigandPNGBDBM29754(macrocyclic peptidomimetic, 3h)
Affinity DataIC50:  150nM. Assay description: Inhibition of BACE1
In DepthDetails ArticlePubMed