BDBM297630 2-((2-cyclopropyl-5-fluoro-4-(4- (2-methoxyphenyl)piperidin-1- yl)quinazolin-6- yl)(methyl)amino)ethanol::US10118902, Example 132::US10118902, Example 167::US10584103, Example 167
SMILES COc1ccccc1C1CCN(CC1)c1nc(nc2ccc(N(C)CCO)c(F)c12)C1CC1
InChI Key InChIKey=UGXUKAATVWVURM-UHFFFAOYSA-N
Data  5 EC50
  Tab Delimited (TSV)   2D SDfile   Computed 3D by Vconf -m prep SDfile
Find this compound or compounds like it in BindingDB:
Activity Spreadsheet -- Enzyme Inhibition Constant Data from BindingDB
Found 5 hits for monomerid = 297630
TargetNeurotensin receptor type 1(Homo sapiens (Human))
Sanford Burnham Prebys Medical Discovery Institute
US Patent
LigandPNGBDBM297630(2-((2-cyclopropyl-5-fluoro-4-(4- (2-methoxyphenyl)...)
Affinity DataEC50:  1.25E+3nM. Assay description: NTSR1 (NTR1) CHO cells are plated in 20 uL of assay media containing Ham's F12 supplemented with 10% fetal bovine serum and 0.4 mg/mL G418 at a c...
Ligand InfoPC cidPC sid
In DepthDetails US Patent
TargetNeurotensin receptor type 1(Homo sapiens (Human))
Sanford Burnham Prebys Medical Discovery Institute
US Patent
LigandPNGBDBM297630(2-((2-cyclopropyl-5-fluoro-4-(4- (2-methoxyphenyl)...)
Affinity DataEC50:  1.25E+3nM. Assay description: NTSR1 (NTR1) CHO cells are plated in 20 uL of assay media containing Ham's F12 supplemented with 10% fetal bovine serum and 0.4 mg/mL G418 at a c...
Ligand InfoPC cidPC sid
In DepthDetails US Patent
TargetNeurotensin receptor type 1(Homo sapiens (Human))
Sanford Burnham Prebys Medical Discovery Institute
US Patent
LigandPNGBDBM297630(2-((2-cyclopropyl-5-fluoro-4-(4- (2-methoxyphenyl)...)
Affinity DataEC50:  590nM. Assay description: Allosteric modulation of human GFP-fused PK-tagged Gq-coupled NTR1 expressed in CHOK1 cells assessed as induction of NT (8 to 13) peptide-mediated be...
Ligand InfoPC cidPC sid
In DepthDetails ArticlePubMed
TargetNeurotensin receptor type 1(Homo sapiens (Human))
Sanford Burnham Prebys Medical Discovery Institute
US Patent
LigandPNGBDBM297630(2-((2-cyclopropyl-5-fluoro-4-(4- (2-methoxyphenyl)...)
Affinity DataEC50:  1.25E+3nM. Assay description: NTSR1 (NTR1) CHO cells are plated in 20 μL of assay media containing Ham's F12 supplemented with 10% fetal bovine serum and 0.4 mg/mL G418 a...
Ligand InfoPC cidPC sid
In DepthDetails US Patent
TargetNeurotensin receptor type 1(Homo sapiens (Human))
Sanford Burnham Prebys Medical Discovery Institute
US Patent
LigandPNGBDBM297630(2-((2-cyclopropyl-5-fluoro-4-(4- (2-methoxyphenyl)...)
Affinity DataEC50:  1.25E+3nM. Assay description: NTSR1 (NTR1) CHO cells are plated in 20 μL of assay media containing Ham's F12 supplemented with 10% fetal bovine serum and 0.4 mg/mL G418 a...
Ligand InfoPC cidPC sid
In DepthDetails US Patent