BDBM297635 2-({2-cyclopropyl-4-[4-(2- methoxy-phenyl)-piperidin-1-yl]- pyrido[3,4-d]pyrimidin-6-yl}- methyl-amino)-ethanol::US10118902, Example 137::US10584103, Example 137
SMILES COc1ccccc1C1CCN(CC1)c1nc(nc2cnc(cc12)N(C)CCO)C1CC1
InChI Key InChIKey=ARFBWKMJVLZODB-UHFFFAOYSA-N
Data  2 EC50
  Tab Delimited (TSV)   2D SDfile   Computed 3D by Vconf -m prep SDfile
Find this compound or compounds like it in BindingDB:
Activity Spreadsheet -- Enzyme Inhibition Constant Data from BindingDB
Found 2 hits for monomerid = 297635
TargetNeurotensin receptor type 1(Homo sapiens (Human))
Sanford Burnham Prebys Medical Discovery Institute
US Patent
LigandPNGBDBM297635(2-({2-cyclopropyl-4-[4-(2- methoxy-phenyl)-piperid...)
Affinity DataEC50: <500nM. Assay description: NTSR1 (NTR1) CHO cells are plated in 20 μL of assay media containing Ham's F12 supplemented with 10% fetal bovine serum and 0.4 mg/mL G418 a...
Ligand InfoPC cidPC sid
In DepthDetails US Patent
TargetNeurotensin receptor type 1(Homo sapiens (Human))
Sanford Burnham Prebys Medical Discovery Institute
US Patent
LigandPNGBDBM297635(2-({2-cyclopropyl-4-[4-(2- methoxy-phenyl)-piperid...)
Affinity DataEC50: <500nM. Assay description: NTSR1 (NTR1) CHO cells are plated in 20 uL of assay media containing Ham's F12 supplemented with 10% fetal bovine serum and 0.4 mg/mL G418 at a c...
Ligand InfoPC cidPC sid
In DepthDetails US Patent