BDBM297772 US10118918, Compound 53
SMILES CC(=O)N1CCC(CC1)Nc1cc(ccn1)C(=O)NC[C@H](O)CN1CCCc2ccccc2C1
InChI Key InChIKey=KIPVHLHMPUFXBJ-DEOSSOPVSA-N
Data  1 IC50
  Tab Delimited (TSV)   2D SDfile   Computed 3D by Vconf -m prep SDfile
Find this compound or compounds like it in BindingDB:
Activity Spreadsheet -- Enzyme Inhibition Constant Data from BindingDB
Found 1 hit for monomerid = 297772
TargetProtein arginine N-methyltransferase 5(Homo sapiens (Human))
Epizyme
US Patent
LigandPNGBDBM297772(US10118918, Compound 53)
Affinity DataIC50:  5.50E+3nM. Assay description: The assays were all performed in a buffer consisting of 20 mM Bicine (pH=7.6), 1 mM TCEP, 0.005% BSG, and 0.002% Tween20, prepared on the day of use....
Ligand InfoPC cidPC sid
In DepthDetails US Patent