BDBM29796 sulfonamide tricyclic analogue, 7
SMILES CCn1cc2CCS(=O)(=O)N(C)c3cc(cc1c23)C(=O)N[C@@H](Cc1ccccc1)[C@H](O)CNCCC(F)(F)F
InChI Key InChIKey=BFPPEQNMYUIWBA-XUZZJYLKSA-N
Data  3 IC50
  Tab Delimited (TSV)   2D SDfile   Computed 3D by Vconf -m prep SDfile
Find this compound or compounds like it in BindingDB:
Activity Spreadsheet -- Enzyme Inhibition Constant Data from BindingDB
Found 3 hits for monomerid = 29796
TargetBeta-secretase 1(Homo sapiens (Human))
Gsk
LigandPNGBDBM29796(sulfonamide tricyclic analogue, 7)
Affinity DataIC50:  4nMpH: 4.5 T: 2°C. Assay description: Enzyme activity and inhibition were assayed using a fluorescent FAM-[SEVNLDAEFK]-TAMRA substrate. Control reactions with no enzyme were included in e...
In DepthDetails ArticlePubMed
TargetCathepsin D(Homo sapiens (Human))
Gsk
LigandPNGBDBM29796(sulfonamide tricyclic analogue, 7)
Affinity DataIC50:  570nM. Assay description: Enzyme activity and inhibition were assayed using a fluorescent FAM-[SEVNLDAEFK]-TAMRA substrate. Control reactions with no enzyme were included in e...
In DepthDetails ArticlePubMed
TargetBeta-secretase 2(Homo sapiens (Human))
Gsk
LigandPNGBDBM29796(sulfonamide tricyclic analogue, 7)
Affinity DataIC50:  75nM. Assay description: Enzyme activity and inhibition were assayed using a fluorescent FAM-[SEVNLDAEFK]-TAMRA substrate. Control reactions with no enzyme were included in e...
In DepthDetails ArticlePubMed