BDBM298055 3-[4-(2-fluorophenyl)-1,3-thiazol-2-yl]-7-(piperidin-4-yl)pyrazolo[1,5-c]pyrimidin-5(4H)-one hydrochloride::US10118930, Example 267
SMILES Fc1ccccc1-c1csc(n1)-c1cnn2c(cc(=O)[nH]c12)C1CCNCC1
InChI Key InChIKey=GSDBCUXSOHRFLB-UHFFFAOYSA-N
Data  1 IC50
  Tab Delimited (TSV)   2D SDfile   Computed 3D by Vconf -m prep SDfile
Find this compound or compounds like it in BindingDB:
Activity Spreadsheet -- Enzyme Inhibition Constant Data from BindingDB
Found 1 hit for monomerid = 298055
TargetTissue-type plasminogen activator(Homo sapiens (Human))
Bayer Pharma Aktiengesellschaft
US Patent
LigandPNGBDBM298055(3-[4-(2-fluorophenyl)-1,3-thiazol-2-yl]-7-(piperid...)
Affinity DataIC50:  15nM. Assay description: The clot-lysis test system configures the kinetics of clot formation and degradation in vitro and allows quantifying modulation of the process by sel...
Ligand InfoPC cidPC sid
In DepthDetails US Patent