BDBM29823 4-indolylamino-5-phenyl-3-pyridinecarbonitrile, 12c
SMILES N#Cc1cncc(-c2cccc(OCCN3CCOCC3)c2)c1Nc1cccc2[nH]ccc12
InChI Key InChIKey=QEKLUEUSIGZNIT-UHFFFAOYSA-N
Data  1 IC50
  Tab Delimited (TSV)   2D SDfile   Computed 3D by Vconf -m prep SDfile
Find this compound or compounds like it in BindingDB:
Activity Spreadsheet -- Enzyme Inhibition Constant Data from BindingDB
Found 1 hit for monomerid = 29823
TargetProtein kinase C theta type(Homo sapiens (Human))
Wyeth Research
LigandPNGBDBM29823(4-indolylamino-5-phenyl-3-pyridinecarbonitrile, 12...)
Affinity DataIC50:  17nMpH: 7.2 T: 2°C. Assay description: All IC50s were measured by using a modified IMAP protocol from Molecular Devices. The kinase reaction was carried out in a Corning Costar 384 well pl...
In DepthDetails ArticlePubMed