BDBM298341 4-[({3-[5-Chloro-2-(1H-tetrazol-1-yl)phenyl]-7-hydroxy-1-oxido-6,7-dihydro-5H-cyclopenta[b]pyridin-7-yl}carbonyl)amino]benzoic acid::US10123995, Example 19
SMILES CC(C)(C)OC(=O)c1ccc(NC(=O)C2(O)CCc3cc(cnc23)-c2cc(Cl)ccc2-n2cnnn2)cc1
InChI Key InChIKey=VXERMDCBSOMJCB-UHFFFAOYSA-N
Data  2 IC50
  Tab Delimited (TSV)   2D SDfile   Computed 3D by Vconf -m prep SDfile
Find this compound or compounds like it in BindingDB:
Activity Spreadsheet -- Enzyme Inhibition Constant Data from BindingDB
Found 2 hits for monomerid = 298341
TargetCoagulation factor XI(Homo sapiens (Human))
Merck Sharp & Dohme
US Patent
LigandPNGBDBM298341(4-[({3-[5-Chloro-2-(1H-tetrazol-1-yl)phenyl]-7-hyd...)
Affinity DataIC50:  1.37E+3nM. Assay description: The effectiveness of a compound of the present invention as an inhibitor of Kallikrein can be determined using a relevant purified serine protease, a...
Ligand InfoPC cidPC sid
In DepthDetails US Patent
TargetCoagulation factor XI(Homo sapiens (Human))
Merck Sharp & Dohme
US Patent
LigandPNGBDBM298341(4-[({3-[5-Chloro-2-(1H-tetrazol-1-yl)phenyl]-7-hyd...)
Affinity DataIC50:  6nM. Assay description: The effectiveness of a compound of the present invention as an inhibitor of Coagulation Factor XIa can be determined using a relevant purified serine...
Ligand InfoPC cidPC sid
In DepthDetails US Patent