BDBM298384 N-(5-(tert-Butyl)-3-(3-(4-((2-((3-cyano-4-(2-morpholinoethoxy)phenyl)amino)pyridin-4-yl)oxy)naphthalen-1-yl)ureido)-2-methoxyphenyl)methanesulfonamide::US10125100, Example 9::US10392346, Example 9::US10941115, Example 9::US9751837, Example 9
SMILES COc1c(NC(=O)Nc2ccc(Oc3ccnc(Nc4ccc(OCCN5CCOCC5)c(c4)C#N)c3)c3ccccc23)cc(cc1NS(C)(=O)=O)C(C)(C)C
InChI Key InChIKey=AJJZMNCMJRGQGR-UHFFFAOYSA-N
Data  4 IC50
  Tab Delimited (TSV)   2D SDfile   Computed 3D by Vconf -m prep SDfile
Find this compound or compounds like it in BindingDB:
Activity Spreadsheet -- Enzyme Inhibition Constant Data from BindingDB
Found 4 hits for monomerid = 298384
TargetBaculoviral IAP repeat-containing protein 2 [174-256](Homo sapiens (Human))
Topivert Pharma
US Patent
LigandPNGBDBM298384(N-(5-(tert-Butyl)-3-(3-(4-((2-((3-cyano-4-(2-morph...)
Affinity DataIC50:  197nM. Assay description: p38 MAPKγ: The inhibitory activities of compounds of the invention against p38MAPKγ (MAPK12: Invitrogen), are evaluated in a similar fashio...
Ligand InfoPC cidPC sid
In DepthDetails US Patent
TargetGlycogen synthase kinase-3 alpha(Homo sapiens (Human))
Topivert Pharma
US Patent
LigandPNGBDBM298384(N-(5-(tert-Butyl)-3-(3-(4-((2-((3-cyano-4-(2-morph...)
Affinity DataIC50:  4.34E+3nM. Assay description: GSK 3α Method 2: This method follows the same steps as Method 1, but utilises a shorter period of mixing of the test compound (105 minutes inste...
Ligand InfoPC cidPC sid
In DepthDetails US Patent
TargetTyrosine-protein kinase SYK(Homo sapiens (Human))
Topivert Pharma
US Patent
LigandPNGBDBM298384(N-(5-(tert-Butyl)-3-(3-(4-((2-((3-cyano-4-(2-morph...)
Affinity DataIC50: >1.28E+3nM. Assay description: c-Src and Syk: The inhibitory activities of compounds of the invention against c-Src and Syk enzymes (Invitrogen), are evaluated in a similar fashion...
Ligand InfoPC cidPC sid
In DepthDetails US Patent
TargetProto-oncogene tyrosine-protein kinase Src(Homo sapiens (Human))
Topivert Pharma
US Patent
LigandPNGBDBM298384(N-(5-(tert-Butyl)-3-(3-(4-((2-((3-cyano-4-(2-morph...)
Affinity DataIC50:  316nM. Assay description: c-Src and Syk: The inhibitory activities of compounds of the invention against c-Src and Syk enzymes (Invitrogen), are evaluated in a similar fashion...
Ligand InfoPC cidPC sid
In DepthDetails US Patent