BDBM298434 4-((4-((4-(3-(5-(tert-Butyl)-2-methoxy-3-(methylsulfonamido)phenyl)ureido)naphthalen-1-yl)oxy)pyridin-2-yl)amino)-N-(1,3-dihydroxy-2-(hydroxymethyl)propan-2-yl)-2-methoxybenzamide::US10125100, Example 17(cm)::US10392346, Example 17(cm)::US10941115, Example 17(cm)::US9751837, Example 17(cm)
SMILES COc1cc(Nc2cc(Oc3ccc(NC(=O)Nc4cc(cc(NS(C)(=O)=O)c4OC)C(C)(C)C)c4ccccc34)ccn2)ccc1C(=O)NC(CO)(CO)CO
InChI Key InChIKey=AEQLIHRFVYSWGR-UHFFFAOYSA-N
Data  3 IC50
  Tab Delimited (TSV)   2D SDfile   Computed 3D by Vconf -m prep SDfile
Find this compound or compounds like it in BindingDB:
Activity Spreadsheet -- Enzyme Inhibition Constant Data from BindingDB
Found 3 hits for monomerid = 298434
TargetBaculoviral IAP repeat-containing protein 2 [174-256](Homo sapiens (Human))
Topivert Pharma
US Patent
LigandPNGBDBM298434(4-((4-((4-(3-(5-(tert-Butyl)-2-methoxy-3-(methylsu...)
Affinity DataIC50:  47nM. Assay description: p38 MAPKγ: The inhibitory activities of compounds of the invention against p38MAPKγ (MAPK12: Invitrogen), are evaluated in a similar fashio...
Ligand InfoPC cidPC sid
In DepthDetails US Patent
TargetTyrosine-protein kinase SYK(Homo sapiens (Human))
Topivert Pharma
US Patent
LigandPNGBDBM298434(4-((4-((4-(3-(5-(tert-Butyl)-2-methoxy-3-(methylsu...)
Affinity DataIC50:  82nM. Assay description: c-Src and Syk: The inhibitory activities of compounds of the invention against c-Src and Syk enzymes (Invitrogen), are evaluated in a similar fashion...
Ligand InfoPC cidPC sid
In DepthDetails US Patent
TargetProto-oncogene tyrosine-protein kinase Src(Homo sapiens (Human))
Topivert Pharma
US Patent
LigandPNGBDBM298434(4-((4-((4-(3-(5-(tert-Butyl)-2-methoxy-3-(methylsu...)
Affinity DataIC50:  29nM. Assay description: c-Src and Syk: The inhibitory activities of compounds of the invention against c-Src and Syk enzymes (Invitrogen), are evaluated in a similar fashion...
Ligand InfoPC cidPC sid
In DepthDetails US Patent