BDBM298443 N-(5-(tert-Butyl)-3-(3-(4-((2-((4-((2-(2-(2-hydroxyethoxy)ethoxy)ethyl)sulfonyl)-3-methoxyphenyl)amino)pyridin-4-yl)oxy)naphthalen-1-yl)ureido)-2-methoxyphenyl)-methanesulfonamide::US10125100, Example 40::US10392346, Example 40::US10941115, Example 40::US9751837, Example 40
SMILES COc1cc(Nc2cc(Oc3ccc(NC(=O)Nc4cc(cc(NS(C)(=O)=O)c4OC)C(C)(C)C)c4ccccc34)ccn2)ccc1S(=O)(=O)CCOCCOCCO
InChI Key InChIKey=FWAKQDXLCUPALU-UHFFFAOYSA-N
Data  3 IC50
  Tab Delimited (TSV)   2D SDfile   Computed 3D by Vconf -m prep SDfile
Find this compound or compounds like it in BindingDB:
Activity Spreadsheet -- Enzyme Inhibition Constant Data from BindingDB
Found 3 hits for monomerid = 298443
TargetBaculoviral IAP repeat-containing protein 2 [174-256](Homo sapiens (Human))
Topivert Pharma
US Patent
LigandPNGBDBM298443(N-(5-(tert-Butyl)-3-(3-(4-((2-((4-((2-(2-(2-hydrox...)
Affinity DataIC50:  162nM. Assay description: p38 MAPKγ: The inhibitory activities of compounds of the invention against p38MAPKγ (MAPK12: Invitrogen), are evaluated in a similar fashio...
Ligand InfoPC cidPC sid
In DepthDetails US Patent
TargetTyrosine-protein kinase SYK(Homo sapiens (Human))
Topivert Pharma
US Patent
LigandPNGBDBM298443(N-(5-(tert-Butyl)-3-(3-(4-((2-((4-((2-(2-(2-hydrox...)
Affinity DataIC50:  400nM. Assay description: c-Src and Syk: The inhibitory activities of compounds of the invention against c-Src and Syk enzymes (Invitrogen), are evaluated in a similar fashion...
Ligand InfoPC cidPC sid
In DepthDetails US Patent
TargetProto-oncogene tyrosine-protein kinase Src(Homo sapiens (Human))
Topivert Pharma
US Patent
LigandPNGBDBM298443(N-(5-(tert-Butyl)-3-(3-(4-((2-((4-((2-(2-(2-hydrox...)
Affinity DataIC50:  195nM. Assay description: c-Src and Syk: The inhibitory activities of compounds of the invention against c-Src and Syk enzymes (Invitrogen), are evaluated in a similar fashion...
Ligand InfoPC cidPC sid
In DepthDetails US Patent