BDBM298479 US10125101, Example 29
SMILES Cc1cc(cc(C)c1-c1ccc(F)c2[C@@H](CCc12)Nc1ccc(nc1)[C@H]1C[C@@H]1C(O)=O)-c1ccn(C)c(=O)c1
InChI Key InChIKey=HTIVIPSYPPRWRG-PNIUZAESSA-N
Data  2 IC50  1 EC50
  Tab Delimited (TSV)   2D SDfile   Computed 3D by Vconf -m prep SDfile
Find this compound or compounds like it in BindingDB:
Activity Spreadsheet -- Enzyme Inhibition Constant Data from BindingDB
Found 3 hits for monomerid = 298479
TargetFree fatty acid receptor 1(Homo sapiens (Human))
Boehringer Ingelheim International
US Patent
LigandPNGBDBM298479(US10125101, Example 29)
Affinity DataEC50:  4nM
Ligand InfoPC cidPC sid
In DepthDetails US Patent
TargetCytochrome P450 2C9(Homo sapiens (Human))
Boehringer Ingelheim International
US Patent
LigandPNGBDBM298479(US10125101, Example 29)
Affinity DataIC50: >5.00E+4nM. Assay description: The inhibition of cytochrome P450 2C9-isoenzyme catalyzed hydroxylation of diclofenac by the test compound is assayed at 37° C. with human liver micr...
Ligand InfoPC cidPC sid
In DepthDetails US Patent
TargetCytochrome P450 2C8(Homo sapiens (Human))
Boehringer Ingelheim International
US Patent
LigandPNGBDBM298479(US10125101, Example 29)
Affinity DataIC50:  1.40E+4nM. Assay description: The inhibition of cytochrome P450 2C8-isoenzyme catalyzed deethylation of amodiaquine by the test compound is assayed at 37° C. with human liver micr...
Ligand InfoPC cidPC sid
In DepthDetails US Patent