BDBM298548 US10125111, Compound 4004
SMILES CNC(=O)c1c(oc2cc(N(CCCF)S(C)(=O)=O)c(cc12)-c1cccc(c1)C(=O)NC(CF)(CF)CF)-c1ccc(F)cc1
InChI Key InChIKey=XZAUVUKJDFVVMP-UHFFFAOYSA-N
Data  1 EC50
  Tab Delimited (TSV)   2D SDfile   Computed 3D by Vconf -m prep SDfile
Find this compound or compounds like it in BindingDB:
Activity Spreadsheet -- Enzyme Inhibition Constant Data from BindingDB
Found 1 hit for monomerid = 298548
TargetGenome polyprotein(Hepatitis C virus (HCV))
Bristol-Myers Squibb
US Patent
LigandPNGBDBM298548(US10125111, Compound 4004)
Affinity DataEC50: <100nM. Assay description: To evaluate compound efficacy, titrated compounds were transferred to sterile 384-well tissue culture treated plates, and the plates were seeded with...
Ligand InfoPC cidPC sid
In DepthDetails US Patent