BDBM298777 US10125118, Example 183::US10947215, Example 183
SMILES CCN1CCN(Cc2ccc(cc2)-c2ccc(CO[C@H]3CCC[C@@H]3NC(=O)c3cc(cnc3N)-c3cnn(C)c3)cc2)CC1
InChI Key InChIKey=UAKWEILUPRQORO-LQJZCPKCSA-N
Data  2 IC50
  Tab Delimited (TSV)   2D SDfile   Computed 3D by Vconf -m prep SDfile
Find this compound or compounds like it in BindingDB:
Activity Spreadsheet -- Enzyme Inhibition Constant Data from BindingDB
Found 2 hits for monomerid = 298777
TargetTyrosine-protein kinase Mer/receptor UFO(Homo sapiens (Human))
Dong-A Socio Holdings
US Patent
LigandPNGBDBM298777(US10125118, Example 183 | US10947215, Example 183)
Affinity DataIC50: <10nM. Assay description: For the SAR (structure-activity relationship) and compound screening, LanthaScreen™ TR-FRET (Time-Resolved fluorescence energy transfer) assay was em...
Ligand InfoPC cidPC sid
In DepthDetails US Patent
TargetTyrosine-protein kinase Mer(Homo sapiens (Human))
Dong-A Socio Holdings
US Patent
LigandPNGBDBM298777(US10125118, Example 183 | US10947215, Example 183)
Affinity DataIC50: <10nM. Assay description: TBD
Ligand InfoPC cidPC sid
In DepthDetails US Patent