BDBM298834 US10125118, Example 240::US10947215, Example 240
SMILES Cn1cc(cn1)-c1cnc(N)c(c1)C(=O)N[C@H]1CCC[C@@H]1OCc1ccc(cc1)-c1ccc(CC2CCN(CCO)CC2)cc1
InChI Key InChIKey=TWPIHVJGJGEAGZ-HEVIKAOCSA-N
Data  2 IC50
  Tab Delimited (TSV)   2D SDfile   Computed 3D by Vconf -m prep SDfile
Find this compound or compounds like it in BindingDB:
Activity Spreadsheet -- Enzyme Inhibition Constant Data from BindingDB
Found 2 hits for monomerid = 298834
TargetTyrosine-protein kinase Mer/receptor UFO(Homo sapiens (Human))
Dong-A Socio Holdings
US Patent
LigandPNGBDBM298834(US10125118, Example 240 | US10947215, Example 240)
Affinity DataIC50: <10nM. Assay description: For the SAR (structure-activity relationship) and compound screening, LanthaScreen™ TR-FRET (Time-Resolved fluorescence energy transfer) assay was em...
Ligand InfoPC cidPC sid
In DepthDetails US Patent
TargetTyrosine-protein kinase Mer(Homo sapiens (Human))
Dong-A Socio Holdings
US Patent
LigandPNGBDBM298834(US10125118, Example 240 | US10947215, Example 240)
Affinity DataIC50: <10nM. Assay description: TBD
Ligand InfoPC cidPC sid
In DepthDetails US Patent