BDBM29892 alkynyl ether, 34
SMILES CCC#CCOc1cc(CNc2ccc(cc2)C(F)(F)F)ccc1Sc1ccc(OCC(O)=O)c2CCCCc12
InChI Key InChIKey=KHAMFOORFHTJFN-UHFFFAOYSA-N
Data  3 KI  2 EC50
  Tab Delimited (TSV)   2D SDfile   Computed 3D by Vconf -m prep SDfile
Find this compound or compounds like it in BindingDB:
Activity Spreadsheet -- Enzyme Inhibition Constant Data from BindingDB
Found 3 hits for monomerid = 29892
TargetPeroxisome proliferator-activated receptor delta(Homo sapiens (Human))
Amgen
LigandPNGBDBM29892(alkynyl ether, 34)
Affinity DataKi:  660nM EC50:  3.10E+3nM. Assay description: The human PPARdelta ligand binding was directly measured using a scintillation proximity assay. Plates were read on a Packard TopCount. IC50 values f...
Ligand InfoPC cidPC sid
In DepthDetails ArticlePubMed
TargetPeroxisome proliferator-activated receptor alpha(Homo sapiens (Human))
Amgen
LigandPNGBDBM29892(alkynyl ether, 34)
Affinity DataKi:  5.90E+3nM ΔG°:  -7.06kcal/mole EC50: >1.00E+5nMpH: 7.1 T: 2°C. Assay description: The human PPARalpha ligand binding was directly measured using a scintillation proximity assay. Plates were read on a Packard TopCount. IC50 values f...
Ligand InfoPC cidPC sid
In DepthDetails ArticlePubMed
TargetPeroxisome proliferator-activated receptor gamma(Homo sapiens (Human))
Amgen
LigandPNGBDBM29892(alkynyl ether, 34)
Affinity DataKi: >1.00E+4nM. Assay description: The human PPARgamma ligand binding was directly measured using a filtration assay in a UniFilter 350 96-well assay plate (Polyfiltronics). The reacti...
Ligand InfoPC cidPC sid
In DepthDetails ArticlePubMed